{"text_format":"1","workbook":"xlsx","n_sheets":13,"sheets":["DATA","Applicant Instructions","IF1","IF2","AFR","COF","AUA","TAX","MAA","PMA","ITE","Declaration","Result Summary"],"not_rendered":{"charts":0,"images":2,"macros":1,"external_links":0,"defined_names":17,"comments":0,"pivot_tables":0},"unopened":[],"bounds":{"document_bytes":16777216,"sheet_cells":100000,"rows_first":2000,"rows_last":500,"rows_between":2000,"halvings":0,"cell_chars":16384,"cell_head_chars":4096},"cells_cut":0,"cells_raw":0,"read":"whole","date_system":"1900"}

{"sheet":"DATA","index":0,"n_rows":17,"n_cols":6,"rows_kept":17,"cut":false,"hidden":true,"merged":[]}
[]
[]
["Applicant results",null,null,null,"Reviewer Results"]
["Full exemption (course and exam) ","You may be eligible for a full course and exam exemption. Submit a copy of this self-assessment and course syllabus as part of your transcript/eligibility assessment application for a complete assessment",null,null,"Full exemption (course and exam) ","Eligible for full course and exam exemption"]
["Partial exemption (course only)","You may be eligible for an exemption from the course and eligible to sit a challenge exam. Submit a copy of this self-assessment and any relevant documentation to verify the course(s) listed above as part of your transcript/eligibility assessment application for a complete assessment.",null,null,"Partial exemption (course only)","Eligible for course exemption and eligible to sit a challenge exam"]
["No exemption ","You are not eligible for a full or partial exemption from this course based on the information entered above. Your next step is to submit a transcript/eligibility assessment application where submission of this self-assessment is not required OR if you have already received your initial assessment results, proceed with enrolling in the required CPA preparatory course",null,null,"No exemption ","Not eligible for exemption. Must complete the course and exam"]
[null,null,null,null,"Further Review Required"]
[]
["Course Topic Scoring"]
["Yes - one course"]
{"$rows_left_out":8}
{"sheet":"Applicant Instructions","index":1,"n_rows":90,"n_cols":5,"rows_kept":90,"cut":false,"hidden":false,"merged":[[72,2,72,10],[80,1,80,3],[61,3,63,10],[12,1,12,2],[13,1,13,2],[14,1,14,2],[17,1,17,2],[32,2,32,10],[28,3,28,6],[30,3,30,5],[25,1,25,3],[41,2,41,3],[42,2,42,3],[55,2,55,4],[56,2,56,3],[88,4,88,5],[89,4,89,5],[8,1,8,10],[6,1,7,10],[19,1,19,10],[10,1,10,10],[81,1,81,11],[20,2,21,10],[22,2,23,10],[65,2,65,4],[75,3,75,8],[76,3,78,8],[26,2,26,10],[40,2,40,10],[58,2,58,10],[54,2,54,10],[85,4,85,5],[83,4,83,5],[84,4,84,5],[86,4,86,5],[87,4,87,5]]}
[]
[]
[]
[]
[]
[]
[null,"Applicant Self-Assessment Tool"]
[]
[null,"The purpose of the self-assessment is to provide applicants the ability to self-assess their prior academic knowledge for admission to CPA PEP. It is intended for applicants who have completed courses (in or outside of Canada) that are not pre-approved by a regional/provincial CPA Body."]
[]
{"$rows_left_out":81}
{"sheet":"IF1","index":2,"n_rows":60,"n_cols":9,"rows_kept":60,"cut":false,"hidden":true,"merged":[[0,1,0,8],[10,1,10,8],[11,1,11,8],[7,1,8,2],[46,2,47,6],[46,1,47,1],[43,2,43,3],[44,2,44,3],[6,1,6,2]]}
[null,"Applicant Self-Assessment Tool"]
[null,"CPA Competency Area: Financial Reporting"]
[]
[null,"CPA Preparatory Course Name: Intermediate Financial Reporting 1 ",null,null,null,"Additional Course Information:"]
[null,"Course Code: IF1",null,null,null,"Intermediate Financial Reporting 1 Course Syllabus"]
[null,"Course Type: Core Course",null,null,null,"CPA Preparatory Course Syllabus"]
[null,"Course Prerequisites: Introductory Financial Accounting, Introductory Management Accounting ",null,null,null,"CPA Preparatory Course Exam Blueprint"]
[null,"Course Description: This course builds on the knowledge learned in Introductory Financial Accounting, focusing primarily on the assets side of the statement of financial position, including: cash, receivables, inventories, capital assets, intangible assets, investments."]
[]
[]
{"$rows_left_out":51}
{"sheet":"IF2","index":3,"n_rows":60,"n_cols":9,"rows_kept":60,"cut":false,"hidden":true,"merged":[[44,2,44,3],[46,1,47,1],[46,2,47,6],[0,1,0,8],[6,1,6,2],[7,1,8,2],[10,1,10,8],[11,1,11,8],[43,2,43,3]]}
[null,"Applicant Self-Assessment Tool"]
[null,"CPA Competency Area: Financial Reporting"]
[]
[null,"CPA Preparatory Course Name: Intermediate Financial Reporting 2 ",null,null,null,"Additional Course Information:"]
[null,"Course Code: IF2",null,null,null,"Intermediate Financial Reporting 2 Course Syllabus"]
[null,"Course Type: Core Course",null,null,null,"CPA Preparatory Course Syllabus"]
[null,"Course Prerequisites: Introductory Financial Accounting, Introductory Management Accounting, Intermediate Financial Reporting 1  ",null,null,null,"CPA Preparatory Course Exam Blueprint"]
[null,"Course Description: This course builds on the knowledge learned in Introductory Financial Accounting and Intermediate Financial Reporting 1, focusing primarily on the liabilities and shareholder’s equity side of the statement of financial position, including: leases, pension plans and other employee future benefits, deferred income taxes, financial instruments, earnings per share, financial statement analysis. "]
[]
[]
{"$rows_left_out":51}
{"sheet":"AFR","index":4,"n_rows":60,"n_cols":9,"rows_kept":60,"cut":false,"hidden":true,"merged":[[44,2,44,3],[46,1,47,1],[46,2,47,6],[0,1,0,8],[6,1,6,2],[7,1,8,2],[10,1,10,8],[11,1,11,8],[43,2,43,3]]}
[null,"Applicant Self-Assessment Tool"]
[null,"CPA Competency Area: Financial Reporting"]
[]
[null,"CPA Preparatory Course Name: Advanced Financial Reporting",null,null,null,"Additional Course Information:"]
[null,"Course Code: AFR",null,null,null,"CPA Preparatory Course Syllabus"]
[null,"Course Type: Core Course",null,null,null,"Advanced Financial Reporting Course Primer"]
[null,"Course Prerequisites: Introductory Financial Accounting, Introductory Management Accounting, Intermediate Financial Reporting 1, Intermediate Financial Reporting 2",null,null,null,"CPA Preparatory Course Exam Blueprint"]
[null,"Course Description: This course discusses financial accounting topics, such as: consolidations, foreign currency, and non-for-profit accounting. "]
[]
[]
{"$rows_left_out":51}
{"sheet":"COF","index":5,"n_rows":60,"n_cols":9,"rows_kept":60,"cut":false,"hidden":true,"merged":[[44,2,44,3],[46,1,47,1],[46,2,47,6],[0,1,0,8],[6,1,6,2],[7,1,8,2],[10,1,10,8],[11,1,11,8],[43,2,43,3]]}
[null,"Applicant Self-Assessment Tool"]
[null,"CPA Competency Area: Finance"]
[]
[null,"CPA Preparatory Course Name: Corporate Finance",null,null,null,"Additional Course Information:"]
[null,"Course Code: COF",null,null,null,"CPA Preparatory Course Syllabus"]
[null,"Course Type: Core Course",null,null,null,"Corporate Finance Course Primer"]
[null,"Course Prerequisites: Introductory Financial Accounting, Introductory Management Accounting ",null,null,null,"CPA Preparatory Course Exam Blueprint"]
[null,"Course Description: This course introduces you to finance concepts and tools used in corporate finance. The course examines the corporate financial environment and its impact on decision-making. Some introductory finance concepts covered in the course include the time value of money, investing, risk management and the distribution of earnings. Capital budgeting techniques, short-term, medium-term, and long-term financing decisions are also examined in this course. "]
[]
[]
{"$rows_left_out":51}
{"sheet":"AUA","index":6,"n_rows":60,"n_cols":9,"rows_kept":60,"cut":false,"hidden":true,"merged":[[44,2,44,3],[46,1,47,1],[46,2,47,6],[0,1,0,8],[6,1,6,2],[7,1,8,2],[10,1,10,8],[11,1,11,8],[43,2,43,3]]}
[null,"Applicant Self-Assessment Tool"]
[null,"CPA Competency Area: Audit and Assurance  "]
[]
[null,"CPA Preparatory Course Name: Audit and Assurance",null,null,null,"Additional Course Information:"]
[null,"Course Code: AUA",null,null,null,"CPA Preparatory Course Syllabus"]
[null,"Course Type: Core Course",null,null,null,"Audit and Assurance Course Primer"]
[null,"Course Prerequisites: Introductory Financial Accounting, Introductory Management Accounting, Intermediate Financial Reporting 1, Intermediate Financial Reporting 2",null,null,null,"CPA Preparatory Course Exam Blueprint"]
[null,"Course Description: This course provides an overview of key concepts in audit and assurance, covering topics such as: assurance vs. non-assurance engagements, auditing standards, rules of professional conduct, ethical standards, professional skepticism, client acceptance, audit planning (risk, approach, materiality, procedures), other audit topics (going concern, fraud, related parties, service organizations, experts, internal audit, quality control), internal controls and specific impacts of information systems and data analytics on control procedures, audit evidence and testing including performing procedures, audit completion and the auditor’s report. "]
[]
[]
{"$rows_left_out":51}
{"sheet":"TAX","index":7,"n_rows":60,"n_cols":9,"rows_kept":60,"cut":false,"hidden":true,"merged":[[44,2,44,3],[46,1,47,1],[46,2,47,6],[0,1,0,8],[6,1,6,2],[7,1,8,2],[10,1,10,8],[11,1,11,8],[43,2,43,3]]}
[null,"Applicant Self-Assessment Tool"]
[null,"CPA Competency Area: Taxation"]
[]
[null,"CPA Preparatory Course Name: Taxation",null,null,null,"Additional Course Information:"]
[null,"Course Code: TAX",null,null,null,"Taxation Course Syllabus"]
[null,"Course Type: Core Course",null,null,null,"CPA Preparatory Course Syllabus"]
[null,"Course Prerequisites: Introductory Financial Accounting, Introductory Management Accounting, Intermediate Financial Reporting 1, Intermediate Financial Reporting 2",null,null,null,"CPA Preparatory Course Exam Blueprint"]
[null,"Course Description: This course provides an overview of the principles and concepts of the Canadian federal income tax legislation, and builds knowledge of compliance and tax issues for both individuals and corporate entities.  "]
[]
[]
{"$rows_left_out":51}
{"sheet":"MAA","index":8,"n_rows":60,"n_cols":9,"rows_kept":60,"cut":false,"hidden":true,"merged":[[44,2,44,3],[46,1,47,1],[46,2,47,6],[0,1,0,8],[6,1,6,2],[7,1,8,2],[10,1,10,8],[11,1,11,8],[43,2,43,3]]}
[null,"Applicant Self-Assessment Tool"]
[null,"CPA Competency Area: Management Accounting "]
[]
[null,"CPA Preparatory Course Name: Intermediate Management Accounting",null,null,null,"Additional Course Information:"]
[null,"Course Code: MAA",null,null,null,"CPA Preparatory Course Syllabus"]
[null,"Course Type: Core Course",null,null,null,"Intermediate Management Accounting Course Primer"]
[null,"Course Prerequisites: Introductory Financial Accounting, Introductory Management Accounting, Corporate Finance",null,null,null,"CPA Preparatory Course Exam Blueprint"]
[null,"Course Description: This course builds on the knowledge learned in Introductory Management Accounting, focusing primarily on intermediate management accounting topics, including: role of management accounting in decision-making, cost classifications, cost estimation, cost behaviours, costing systems, cost-volume-profit analysis, cost management, budgeting and variance analysis, pricing, decision making in uncertainty, relevant costs, transfer pricing.  "]
[]
[]
{"$rows_left_out":51}
{"sheet":"PMA","index":9,"n_rows":60,"n_cols":9,"rows_kept":60,"cut":false,"hidden":true,"merged":[[44,2,44,3],[46,1,47,1],[46,2,47,6],[0,1,0,8],[6,1,6,2],[7,1,8,2],[10,1,10,8],[11,1,11,8],[43,2,43,3]]}
[null,"Applicant Self-Assessment Tool"]
[null,"CPA Competency Area: Strategy & Governance  "]
[]
[null,"CPA Preparatory Course Name: Performance Management",null,null,null,"Additional Course Information:"]
[null,"Course Code: PMA",null,null,null,"CPA Preparatory Course Syllabus"]
[null,"Course Type: Core Course",null,null,null,"Performance Management Course Primer"]
[null,"Course Prerequisites: Introductory Financial Accounting, Introductory Management Accounting, Intermediate Management Accounting ",null,null,null,"CPA Preparatory Course Exam Blueprint"]
[null,"Course Description: This course is an introductory performance management course. It examines the importance of governance and corporate social responsibility in a business context. The course also highlights the role governance and corporate social responsibility play in developing, formulating, and implementing strategy. "]
[]
[]
{"$rows_left_out":51}
{"sheet":"ITE","index":10,"n_rows":60,"n_cols":9,"rows_kept":60,"cut":false,"hidden":true,"merged":[[44,2,44,3],[46,1,47,1],[46,2,47,6],[0,1,0,8],[6,1,6,2],[7,1,8,2],[10,1,10,8],[11,1,11,8],[43,2,43,3]]}
[null,"Applicant Self-Assessment Tool"]
[null,"CPA Competency Area: Data Analytics and Information Technology"]
[]
[null,"CPA Preparatory Course Name: Information Technology",null,null,null,"Additional Course Information:"]
[null,"Course Code: ITE",null,null,null,"CPA Preparatory Course Syllabus"]
[null,"Course Type: Core Course",null,null,null,"Performance Management Course Primer"]
[null,"Course Prerequisites: Introductory Financial Accounting, Introductory Management Accounting",null,null,null,"CPA Preparatory Course Exam Blueprint"]
[null,"Course Description: This course covers the use of computer-based information systems in management and financial accounting. The course will provide students with the knowledge required to make informed decisions with the application of information technology."]
[]
[]
{"$rows_left_out":51}
{"sheet":"Declaration","index":11,"n_rows":19,"n_cols":24,"rows_kept":19,"cut":false,"hidden":false,"merged":[[7,1,7,9],[11,1,11,9],[9,1,9,9],[18,1,20,9],[16,4,16,6],[16,1,16,2],[15,4,15,6],[15,1,15,2]]}
[null,null,null,null,null,null,null,null,null,null,null,null,null,null,null,null,null,null,null,null,null,null,null,"Self-Assessment COMPLETE"]
[]
[]
[]
[]
[]
[]
[null,"DECLARATION"]
[]
[null,"This declaration must be signed and included with this application. All documentation must be in English or French."]
{"$rows_left_out":10}
{"sheet":"Result Summary","index":12,"n_rows":146,"n_cols":7,"rows_kept":146,"cut":false,"hidden":false,"merged":[[1,1,1,4],[3,1,5,3]]}
[]
[null,"Preliminary Results Summary"]
[]
[null,"Please be aware, the results of this self-assessment are unofficial and intended to provide you with information on the potential exemptions you may be eligible for in the transcript/eligibility assessment process. An official transcript/eligibility assessment application is required to register as a CPA Student and enroll in the CPA Certification Program with your provincial/regional CPA body."]
[]
[]
[]
[null,"Module","Preliminary/Unofficial Results","Reviewer Decision"]
[null,"Intermediate Financial Reporting 1 (IF1)",{"$f":"IF('Applicant Instructions'!$C$45=\"No\",\"Not Assessed\",'IF1'!$C$44)","v":"Not Assessed"},{"$f":"IF('Applicant Instructions'!$C45=\"No\",\"Not Assessed\",\"Further Review Required\")","v":"Not Assessed"}]
[null,"Intermediate Financial Reporting 2 (IF2)",{"$f":"IF('Applicant Instructions'!$C$46=\"No\",\"Not Assessed\",'IF2'!$C$44)","v":"Not Assessed"},{"$f":"IF('Applicant Instructions'!$C46=\"No\",\"Not Assessed\",\"Further Review Required\")","v":"Not Assessed"}]
{"$rows_left_out":136}